Jump to content
metin2dev
Sign in to follow this  
asterix2

Samurai core v1.0/1.1/1.2

Recommended Posts

Game:

- It does not create a test file next to the game file. (makefile)
- Stirps makes the game file. (makefile)
- Limit_time removed (Limit_time.h)
- Internal ip removed (config.cpp)
- 6-7 bonus added/changer enabled. (char_item.cpp)
- Increasing the chance of inserting stones from 30% to 35%. (char_item.cpp)
- 0 gold purchase store item enabled.. (shop.cpp)
- pc_change_name (Europe) enabled. (questlua_pc.cpp)
- 70024 (marble blessing) and enabled store. (hivalue_item_sell check removed) (shop.cpp)
- 6-7 bonus disabled costume. (char_item.cpp)
- max level 250 (constans.cpp, common/lenght.h)
- Dice, ÁÖ»çŔ§ and war fix. (cmd_general.cpp)
- Player bonuses are removed bonus time. (char_item.cpp)
- Stuff disappearance has dropped by 2 minutes 10 seconds players (item.h, char_item.cpp)
- A szorzók mennyisége növelve 1000%-ra. (priv_manager.cpp)
- Client_version_check fixed. (input_login.cpp, config.cpp, input_main.cpp)
- Horse skill enabled. (char_skill.cpp)
- dungeon core crash fix. (char.cpp)
- cube crash fix. (cube.cpp)
- Bonus changer fix. (char_item.cpp)
- ymir licens removed. (input.cpp, input_auth.cpp, main.cpp)
- invisible bug fix. (char_affect.cpp)
- After Teleportation will not be - life. (char.cpp)
- Sura magic sword skill bug fix. (char_battle.cpp)
- 2x fixed Kill counting. (questmanager.cpp)
- If there are multiple kk taking away one. (char_item.cpp)
- Vid fix. (input_main.cpp) //Monster, npc.
- Party teleport fix. (party.cpp)
- Quest core crash fix. (questlua_pc.cpp)
- /reload q crash fix. (questmanager.h, questmanager.cpp)
- PM flood fix. (char.h, char.cpp, input_main.cpp, cmd_general.cpp, messenger_manager.h, messenger_manager.cpp)
- Ingame sql inject fix. (messenger_manager.cpp, messenger_manager.h)
- 4. inventory page. (exchange.cpp, char_item.cpp, common/lenght.h)
- Api tool password modify WTFWTFWTFWTFWTFW. (config.cpp)
- TP- broadcast MP bug fix ( bios bug, bug rush ). (char.cpp)
- Stone chance fix. (char_item.cpp)
- immun bug fix. (item.cpp)
- Reload command expanded. (cmd.cpp, cmd_gm.cpp, input_db.cpp, shop_manager.cpp, refine.cpp, char_manager.cpp, char_manager.h, item_manager.h, item_manager_read_tables.cpp, mob_manager.cpp, mob_manager.h, char.cpp, sectree_manager.cpp, regen.cpp, regen.h, shop.cpp, shop.h)
- Item_type 33 added. (char_item.cpp)
- cube list fix. (cube.cpp)
- Full equip bug fix. (char_item.cpp)
- ds slot fix(common/lenght.h)
- anti long name generator. (input_login.cpp)
- Port repaired (common/tables.h) --
- pc.block_exp & pc.unblock_exp quest function added. (char.cpp, char.h, questlua_pc.cpp, input_login.cpp) --
- Ninja kick fix. (speed) (input_main)
- Maximum stat point 125 && 90 will also receive Status Points .. (cmd_general.cpp, char.cpp)
- Target Information system added. (char.cpp, char.h, input.h, input_main.cpp, item_manager.cpp, item_manager.h, packet.h, packet_info.cpp, common/service.h)
- Inventory Slot Marking System added. (common/lenght.h, exchange.cpp, packet.h)
- 24 slot exchange window. (exchange.cpp, exchange.h)

DB:
- Stirps makes the db file. (Makefile)
- Item_award 3 stone fix. (ClientManager.cpp)
- DB start fix. (Main.cpp, libsql/AsyncSQL.cpp, ClientManager.cpp) (latin2)
- Port fix (ClientManager.h,ClientManager.cpp)


Binary:
- New equipment system enabled. (userinterface/locale_inc.h)
- It handles True,TRUE,true,False,FALSE,false values. (Scriptlib/PythonLauncher.cpp)
- 4. inventory added (userinterface/GameType.h)
- 0 gold Shop fix.. (Userinterface/PythonPlayerModule.cpp)
- /reload q crash fix.( PythonNetworkStream.h, PythonNetworkStream.cpp, PythonNetworkStream.cpp)
- Port fix (packet.h)
- granny updated 2.9-re(EterGrnLib/mesh.cpp, EterGrnLib/ModelInstanceUpdate.cpp, EterGrnLib/Material.cpp, EterGrnLib/ModelInstanceModel.cpp, Userinterface/userinterface.cpp)
- Python updated 2.7-re. (Userinterface.cpp, ScriptLib/PythonUtils.cpp, Scriptlib/PythonLauncher.cpp, Scriptlib/PythonLauncher.h, Scriptlib/PythonMarshal.cpp, Scriptlib/StdAfx.h)
- Target Information system added. (Locale_inc.h, packet.h, PythonApplicationModule.cpp, PythonNetworkStream.cpp, PythonNetworkStream.h, PythonNetworkStreamModule.cpp, PythonNetworkStreamPhaseGame.cpp, PythonNonPlayer.cpp, PythonNonPlayer.h, PythonNonPlayerModule.cpp)
- Inventory Slot Marking System added. (GameType.h, locale_inc.h, Packet.h, PythonApplicationModule.cpp, PythonItemModule.cpp, PythonNetworkStreamPhaseGame.cpp, PythonPlayer.cpp, PythonPlayer.h, PythonPlayerModule.cpp)
- 24 slot exchange window. (PythonExchange.h)
 

 

Download link: https://drive.google.com/open?id=0BzDYQYxDz2BOb0RsN2tZZDBSRTg

Some link: (target information system): -link removed by administration-
24 exchange slot: -link removed by administration-
slot marking system:

(All need only py side)

 

  • Like 2

Share this post


Link to post
Share on other sites

I've this error on compiling:
 

Mxnxzju.png

 

I have read this:

"You need extern and folder"

but where they are? I can take it wherever, or I need the samurai version? 

---------------------------------------------

Ok solved, i downloaded samuraicore 1.2, they have them

Share this post


Link to post
Share on other sites

got this error..

 


In file included from ../../../Extern/include/cryptopp/modes.h:8:0,
                 from cipher.cpp:7:
../../../Extern/include/cryptopp/secblock.h: In instantiation of 'CryptoPP::Allo                                                   catorWithCleanup<T, T_Align16>::pointer CryptoPP::AllocatorWithCleanup<T, T_Alig                                                   n16>::allocate(CryptoPP::AllocatorWithCleanup<T, T_Align16>::size_type, const vo                                                   id*) [with T = unsigned char; bool T_Align16 = false; CryptoPP::AllocatorWithCle                                                   anup<T, T_Align16>::pointer = unsigned char*; CryptoPP::AllocatorWithCleanup<T,                                                    T_Align16>::size_type = unsigned int]':
../../../Extern/include/cryptopp/secblock.h:247:25:   required from 'CryptoPP::S                                                   ecBlock<T, A>::SecBlock(CryptoPP::SecBlock<T, A>::size_type) [with T = unsigned                                                    char; A = CryptoPP::AllocatorWithCleanup<unsigned char>; CryptoPP::SecBlock<T, A                                                   >::size_type = unsigned int]'
../../../Extern/include/cryptopp/algparam.h:17:2:   required from here
../../../Extern/include/cryptopp/secblock.h:91:14: error: 'CheckSize' was not de                                                   clared in this scope, and no declarations were found by argument-dependent looku                                                   p at the point of instantiation [-fpermissive]
   CheckSize(n);
              ^
../../../Extern/include/cryptopp/secblock.h:91:14: note: declarations in depende                                                   nt base 'CryptoPP::AllocatorBase<unsigned char>' are not found by unqualified lo                                                   okup
../../../Extern/include/cryptopp/secblock.h:91:14: note: use 'this->CheckSize' i                                                   nstead
../../../Extern/include/cryptopp/secblock.h: In instantiation of 'CryptoPP::Allo                                                   catorWithCleanup<T, T_Align16>::pointer CryptoPP::AllocatorWithCleanup<T, T_Alig                                                   n16>::allocate(CryptoPP::AllocatorWithCleanup<T, T_Align16>::size_type, const vo                                                   id*) [with T = unsigned char; bool T_Align16 = true; CryptoPP::AllocatorWithClea                                                   nup<T, T_Align16>::pointer = unsigned char*; CryptoPP::AllocatorWithCleanup<T, T                                                   _Align16>::size_type = unsigned int]':
../../../Extern/include/cryptopp/secblock.h:247:25:   required from 'CryptoPP::S                                                   ecBlock<T, A>::SecBlock(CryptoPP::SecBlock<T, A>::size_type) [with T = unsigned                                                    char; A = CryptoPP::AllocatorWithCleanup<unsigned char, true>; CryptoPP::SecBloc                                                   k<T, A>::size_type = unsigned int]'
../../../Extern/include/cryptopp/modes.h:63:34:   required from here
../../../Extern/include/cryptopp/secblock.h:91:14: error: 'CheckSize' was not de                                                   clared in this scope, and no declarations were found by argument-dependent looku                                                   p at the point of instantiation [-fpermissive]
../../../Extern/include/cryptopp/secblock.h:91:14: note: declarations in depende                                                   nt base 'CryptoPP::AllocatorBase<unsigned char>' are not found by unqualified lo                                                   okup
../../../Extern/include/cryptopp/secblock.h:91:14: note: use 'this->CheckSize' i                                                   nstead
../../../Extern/include/cryptopp/secblock.h: In instantiation of 'CryptoPP::Allo                                                   catorWithCleanup<T, T_Align16>::pointer CryptoPP::AllocatorWithCleanup<T, T_Alig                                                   n16>::allocate(CryptoPP::AllocatorWithCleanup<T, T_Align16>::size_type, const vo                                                   id*) [with T = unsigned int; bool T_Align16 = true; CryptoPP::AllocatorWithClean                                                   up<T, T_Align16>::pointer = unsigned int*; CryptoPP::AllocatorWithCleanup<T, T_A                                                   lign16>::size_type = unsigned int]':
../../../Extern/include/cryptopp/secblock.h:249:29:   required from 'CryptoPP::S                                                   ecBlock<T, A>::SecBlock(const CryptoPP::SecBlock<T, A>&) [with T = unsigned int;                                                    A = CryptoPP::AllocatorWithCleanup<unsigned int, true>]'
../../../Extern/include/cryptopp/modarith.h:122:20:   required from here
../../../Extern/include/cryptopp/secblock.h:91:14: error: 'CheckSize' was not de                                                   clared in this scope, and no declarations were found by argument-dependent looku                                                   p at the point of instantiation [-fpermissive]
../../../Extern/include/cryptopp/secblock.h:91:14: note: declarations in depende                                                   nt base 'CryptoPP::AllocatorBase<unsigned int>' are not found by unqualified loo                                                   kup
../../../Extern/include/cryptopp/secblock.h:91:14: note: use 'this->CheckSize' i                                                   nstead
../../../Extern/include/cryptopp/secblock.h: In instantiation of 'CryptoPP::Allo                                                   catorWithCleanup<T, T_Align16>::pointer CryptoPP::AllocatorWithCleanup<T, T_Alig                                                   n16>::allocate(CryptoPP::AllocatorWithCleanup<T, T_Align16>::size_type, const vo                                                   id*) [with T = unsigned int; bool T_Align16 = false; CryptoPP::AllocatorWithClea                                                   nup<T, T_Align16>::pointer = unsigned int*; CryptoPP::AllocatorWithCleanup<T, T_                                                   Align16>::size_type = unsigned int]':
../../../Extern/include/cryptopp/secblock.h:247:25:   required from 'CryptoPP::S                                                   ecBlock<T, A>::SecBlock(CryptoPP::SecBlock<T, A>::size_type) [with T = unsigned                                                    int; A = CryptoPP::AllocatorWithCleanup<unsigned int>; CryptoPP::SecBlock<T, A>:                                                   :size_type = unsigned int]'
../../../Extern/include/cryptopp/rc5.h:22:27:   required from 'CryptoPP::BlockCi                                                   pherFinal<DIR, BASE>::BlockCipherFinal() [with CryptoPP::CipherDir DIR = (Crypto                                                   PP::CipherDir)0u; BASE = CryptoPP::RC5::Enc]'
../../../Extern/include/cryptopp/misc.h:82:7:   required from 'CryptoPP::CipherM                                                   odeFinalTemplate_CipherHolder<CIPHER, BASE>::CipherModeFinalTemplate_CipherHolde                                                   r(const byte*, size_t, const byte*) [with CIPHER = CryptoPP::BlockCipherFinal<(C                                                   ryptoPP::CipherDir)0u, CryptoPP::RC5::Enc>; BASE = CryptoPP::ConcretePolicyHolde                                                   r<CryptoPP::Empty, CryptoPP::AdditiveCipherTemplate<CryptoPP::AbstractPolicyHold                                                   er<CryptoPP::AdditiveCipherAbstractPolicy, CryptoPP::CTR_ModePolicy> > >; byte =                                                    unsigned char; size_t = unsigned int]'
cipher.cpp:88:64:   required from 'CryptoPP::SymmetricCipher* BlockCipherDetail<                                                   T>::CreateEncoder(const byte*, size_t, const byte*) const [with T = CryptoPP::RC                                                   5; byte = unsigned char; size_t = unsigned int]'
cipher.cpp:398:1:   required from here
../../../Extern/include/cryptopp/secblock.h:91:14: error: 'CheckSize' was not de                                                   clared in this scope, and no declarations were found by argument-dependent looku                                                   p at the point of instantiation [-fpermissive]
../../../Extern/include/cryptopp/secblock.h:91:14: note: declarations in depende                                                   nt base 'CryptoPP::AllocatorBase<unsigned int>' are not found by unqualified loo                                                   kup
../../../Extern/include/cryptopp/secblock.h:91:14: note: use 'this->CheckSize' i                                                   nstead
gmake: *** [Makefile:131: OBJDIR/cipher.o] Error 1
gmake: *** Waiting for unfinished jobs....
root@root601683:/usr/src/Source/Server/game/src #

 

  • Thanks 1

Share this post


Link to post
Share on other sites

Hello guys, sorry my offline status.

 

 

I making new project 2k18 summer. :)
 

new src, new english client, new server side.

  • Haha 1

Share this post


Link to post
Share on other sites
On 6/8/2018 at 8:17 PM, asterix2 said:

Hello guys, sorry my offline status.

 

 

I making new project 2k18 summer. :)
 

new src, new english client, new server side.

Dont forget windows sf src client friend asterix please :)

Share this post


Link to post
Share on other sites

Create an account or sign in to comment

You need to be a member in order to leave a comment

Create an account

Sign up for a new account in our community. It's easy!

Register a new account

Sign in

Already have an account? Sign in here.

Sign In Now
Sign in to follow this  

  • Recently Browsing   0 members

    No registered users viewing this page.

×