Jump to content
metin2dev

All Activity

This stream auto-updates     

  1. Today
  2. Driguezgames

    open [WOLFMAN]Animation Bug

    Hello, i installed Lycan from some Files and finally i tryed to enter on my Sever, but i have this bug: I just can't walk , i can't do nothing, what i did wrong? or i miss something?
  3. has somebody oficial item_proto.txt and mob_proto,txt in romanian
  4. Yesterday
  5. mangal1otu

    open compiling source

    I have the next problem when I want to compile the launcher source I'm using Visual Studio 2013 Two days ago worked perfectly, after we introduced the again windows appeared the problem Sorry for my English 1>------ Build started: Project: EterLocale, Configuration: Release Win32 ------ 2>------ Build started: Project: CWebBrowser, Configuration: Release Win32 ------ 2> CWebBrowser.c 2>..\..\source\CWebBrowser\CWebBrowser.c : fatal error C1001: An internal error has occurred in the compiler. 2> (compiler file 'f:\dd\vctools\compiler\cxxfe\sl\p1\c\p0io.c', line 2807) 2> To work around this problem, try simplifying or changing the program near the locations listed above. 2> Please choose the Technical Support command on the Visual C++ 2> Help menu, or open the Technical Support help file for more information 1> StdAfx.cpp 1>..\..\source\EterLocale\StdAfx.cpp : fatal error C1001: An internal error has occurred in the compiler. 1> (compiler file 'f:\dd\vctools\compiler\cxxfe\sl\p1\c\p0io.c', line 2807) 1> To work around this problem, try simplifying or changing the program near the locations listed above. 1> Please choose the Technical Support command on the Visual C++ 1> Help menu, or open the Technical Support help file for more information 3>------ Build started: Project: EffectLib, Configuration: Release Win32 ------ 4>------ Build started: Project: EterBase, Configuration: Release Win32 ------ 3> StdAfx.cpp 3>..\..\source\EffectLib\StdAfx.cpp : fatal error C1001: An internal error has occurred in the compiler. 3> (compiler file 'f:\dd\vctools\compiler\cxxfe\sl\p1\c\p0io.c', line 2807) 3> To work around this problem, try simplifying or changing the program near the locations listed above. 3> Please choose the Technical Support command on the Visual C++ 3> Help menu, or open the Technical Support help file for more information 4> StdAfx.cpp 4>..\..\source\EterBase\StdAfx.cpp : fatal error C1001: An internal error has occurred in the compiler. 4> (compiler file 'f:\dd\vctools\compiler\cxxfe\sl\p1\c\p0io.c', line 2807) 4> To work around this problem, try simplifying or changing the program near the locations listed above. 4> Please choose the Technical Support command on the Visual C++ 4> Help menu, or open the Technical Support help file for more information 5>------ Build started: Project: EterGrnLib, Configuration: Release Win32 ------ 6>------ Build started: Project: EterImageLib, Configuration: Release Win32 ------ 5> StdAfx.cpp 5>..\..\source\EterGrnLib\StdAfx.cpp : fatal error C1001: An internal error has occurred in the compiler. 5> (compiler file 'f:\dd\vctools\compiler\cxxfe\sl\p1\c\p0io.c', line 2807) 5> To work around this problem, try simplifying or changing the program near the locations listed above. 5> Please choose the Technical Support command on the Visual C++ 5> Help menu, or open the Technical Support help file for more information 6> StdAfx.cpp 6>..\..\source\EterImageLib\StdAfx.cpp : fatal error C1001: An internal error has occurred in the compiler. 6> (compiler file 'f:\dd\vctools\compiler\cxxfe\sl\p1\c\p0io.c', line 2807) 6> To work around this problem, try simplifying or changing the program near the locations listed above. 6> Please choose the Technical Support command on the Visual C++ 6> Help menu, or open the Technical Support help file for more information 7>------ Build started: Project: EterLib, Configuration: Release Win32 ------ 8>------ Build started: Project: EterPack, Configuration: Release Win32 ------ 8> EterPack.cpp 8>..\..\source\EterPack\EterPack.cpp : fatal error C1001: An internal error has occurred in the compiler. 8> (compiler file 'f:\dd\vctools\compiler\cxxfe\sl\p1\c\p0io.c', line 2807) 8> To work around this problem, try simplifying or changing the program near the locations listed above. 8> Please choose the Technical Support command on the Visual C++ 8> Help menu, or open the Technical Support help file for more information 8> EterPackCursor.cpp 8>c1xx : warning C4117: macro name '__LINE__' is reserved, '#define' ignored 8>c1xx : warning C4117: macro name '__FILE__' is reserved, '#define' ignored 8>c1xx : warning C4117: macro name '__DATE__' is reserved, '#define' ignored 8>c1xx : warning C4117: macro name '__TIME__' is reserved, '#define' ignored 8>c1xx : warning C4117: macro name '__TIMESTAMP__' is reserved, '#define' ignored 8>c1xx : warning C4117: macro name '__VA_ARGS__' is reserved, '#define' ignored 8>c1xx : warning C4117: macro name '__FUNCTION__' is reserved, '#define' ignored 8>c1xx : warning C4117: macro name '__FUNCDNAME__' is reserved, '#define' ignored 8>c1xx : warning C4117: macro name '__FUNCSIG__' is reserved, '#define' ignored 8>c1xx : warning C4117: macro name '__FSTREXP' is reserved, '#define' ignored 8>c1xx : warning C4117: macro name '__LPREFIX' is reserved, '#define' ignored 8>c1xx : warning C4117: macro name '__APREFIX' is reserved, '#define' ignored 8>c1xx : warning C4117: macro name '__SPREFIX' is reserved, '#define' ignored 8>c1xx : warning C4117: macro name '__cplusplus' is reserved, '#define' ignored 8>c1xx : warning C4117: macro name '__BOOL_DEFINED' is reserved, '#define' ignored 8>c1xx : warning C4117: macro name '_WCHAR_T_DEFINED' is reserved, '#define' ignored 8>c1xx : warning C4117: macro name '_NATIVE_WCHAR_T_DEFINED' is reserved, '#define' ignored 8>c1xx : warning C4117: macro name '_RVALUE_REFERENCES_SUPPORTED' is reserved, '#define' ignored 8>c1xx : warning C4117: macro name '_RVALUE_REFERENCES_V2_SUPPORTED' is reserved, '#define' ignored 8>c1xx : warning C4117: macro name '_NATIVE_NULLPTR_SUPPORTED' is reserved, '#define' ignored 8>c1xx : warning C4117: macro name '__COUNTER__' is reserved, '#define' ignored 8>c1xx : fatal error C1001: An internal error has occurred in the compiler. 8> (compiler file 'msc1.cpp', line 1325) 8> To work around this problem, try simplifying or changing the program near the locations listed above. 8> Please choose the Technical Support command on the Visual C++ 8> Help menu, or open the Technical Support help file for more information 8> INTERNAL COMPILER ERROR in 'C:\Program Files (x86)\Microsoft Visual Studio 12.0\VC\bin\CL.exe' 8> Please choose the Technical Support command on the Visual C++ 8> Help menu, or open the Technical Support help file for more information 7> StdAfx.cpp 7>..\..\source\EterLib\StdAfx.cpp : fatal error C1001: An internal error has occurred in the compiler. 7> (compiler file 'f:\dd\vctools\compiler\cxxfe\sl\p1\c\p0io.c', line 2807) 7> To work around this problem, try simplifying or changing the program near the locations listed above. 7> Please choose the Technical Support command on the Visual C++ 7> Help menu, or open the Technical Support help file for more information 9>------ Build started: Project: EterPythonLib, Configuration: Release Win32 ------ 10>------ Build started: Project: GameLib, Configuration: Release Win32 ------ 9> StdAfx.cpp 9>..\..\source\EterPythonLib\StdAfx.cpp : fatal error C1001: An internal error has occurred in the compiler. 9> (compiler file 'f:\dd\vctools\compiler\cxxfe\sl\p1\c\p0io.c', line 2807) 9> To work around this problem, try simplifying or changing the program near the locations listed above. 9> Please choose the Technical Support command on the Visual C++ 9> Help menu, or open the Technical Support help file for more information 11>------ Build started: Project: MilesLib, Configuration: Release Win32 ------ 10> StdAfx.cpp 10>..\..\source\GameLib\StdAfx.cpp : fatal error C1001: An internal error has occurred in the compiler. 10> (compiler file 'f:\dd\vctools\compiler\cxxfe\sl\p1\c\p0io.c', line 2807) 10> To work around this problem, try simplifying or changing the program near the locations listed above. 10> Please choose the Technical Support command on the Visual C++ 10> Help menu, or open the Technical Support help file for more information 12>------ Build started: Project: PRTerrainLib, Configuration: Release Win32 ------ 11> Stdafx.cpp 11>..\..\source\MilesLib\Stdafx.cpp : fatal error C1001: An internal error has occurred in the compiler. 11> (compiler file 'f:\dd\vctools\compiler\cxxfe\sl\p1\c\p0io.c', line 2807) 11> To work around this problem, try simplifying or changing the program near the locations listed above. 11> Please choose the Technical Support command on the Visual C++ 11> Help menu, or open the Technical Support help file for more information 12> StdAfx.cpp 12>..\..\source\PRTerrainLib\StdAfx.cpp : fatal error C1001: An internal error has occurred in the compiler. 12> (compiler file 'f:\dd\vctools\compiler\cxxfe\sl\p1\c\p0io.c', line 2807) 12> To work around this problem, try simplifying or changing the program near the locations listed above. 12> Please choose the Technical Support command on the Visual C++ 12> Help menu, or open the Technical Support help file for more information 13>------ Build started: Project: ScriptLib, Configuration: Release Win32 ------ 13> StdAfx.cpp 13>..\..\source\ScriptLib\StdAfx.cpp : fatal error C1001: An internal error has occurred in the compiler. 13> (compiler file 'f:\dd\vctools\compiler\cxxfe\sl\p1\c\p0io.c', line 2807) 13> To work around this problem, try simplifying or changing the program near the locations listed above. 13> Please choose the Technical Support command on the Visual C++ 13> Help menu, or open the Technical Support help file for more information 14>------ Build started: Project: SpeedTreeLib, Configuration: Release Win32 ------ 15>------ Build started: Project: SphereLib, Configuration: Release Win32 ------ 14> StdAfx.cpp 14>..\..\source\SpeedTreeLib\StdAfx.cpp : fatal error C1001: An internal error has occurred in the compiler. 14> (compiler file 'f:\dd\vctools\compiler\cxxfe\sl\p1\c\p0io.c', line 2807) 14> To work around this problem, try simplifying or changing the program near the locations listed above. 14> Please choose the Technical Support command on the Visual C++ 14> Help menu, or open the Technical Support help file for more information 15> StdAfx.cpp 15>..\..\source\SphereLib\StdAfx.cpp : fatal error C1001: An internal error has occurred in the compiler. 15> (compiler file 'f:\dd\vctools\compiler\cxxfe\sl\p1\c\p0io.c', line 2807) 15> To work around this problem, try simplifying or changing the program near the locations listed above. 15> Please choose the Technical Support command on the Visual C++ 15> Help menu, or open the Technical Support help file for more information 16>------ Build started: Project: UserInterface, Configuration: Release Win32 ------ 16> StdAfx.cpp 16>..\..\source\UserInterface\StdAfx.cpp : fatal error C1001: An internal error has occurred in the compiler. 16> (compiler file 'f:\dd\vctools\compiler\cxxfe\sl\p1\c\p0io.c', line 2807) 16> To work around this problem, try simplifying or changing the program near the locations listed above. 16> Please choose the Technical Support command on the Visual C++ 16> Help menu, or open the Technical Support help file for more information ========== Build: 0 succeeded, 16 failed, 0 up-to-date, 0 skipped ==========
  6. Adrian1997

    c++ Hide Objects

    Same error...
  7. Tryn

    [GF] Race height of actors

    I think there are some "bugs". If u mount for example the power mounts the texttail is floating miles above you. Also if you're not riding a mount the texttail above them ("XZY's Horse") is also miles above them. Maybe you can take a look for this "bugs". But nice release anyway. Thanks P3ng3r
  8. kingshero

    open little bug in guild war

    hello all explain problem : when start war like use this command : /war guild_name 1 or /war guild_name 2 i have crash core in core 1 , core 2 and core 3 this crash Happen after notice in chat ------------ before warp to map 110 or 111 in this moment the core 1 , core 2 and core 3 is crash and see this 4 line on putty and when debug core i have this please help in my problem and thanks for all syslog in core 1 after crash syslog in core 2 after crash syslog in db after crash
  9. BeHappy4Ever

    open WorldEditor

    I try to use map editor and when i edit c1 the buildings and trees aren't shown.. here is the sysser:
  10. BeHappy4Ever

    Over 200 New Tree's for Maper's

    reupload?
  11. peskopata3

    open [HELP] Ninja Daggers Shine

    Hi guys could someone help me with this ? please I need this effect on both daggers
  12. JarajTo

    open Cube percent in gui - what i forgot?

    How can I help you?
  13. 3bd0

    open upgrading to visual studio 2017

    if you could manage to do it yet, here are they (I just compiled them using v141 toolset) Here
  14. Abel(Tiger)

    open core crush

    Seems like item owner is NULL ...
  15. tierrilopes

    open Compiling the PackMaker

    Remove reducion completly and then use vs2017.
  16. Last week
  17. Салом

    open core crush

    ##
  18. Minton

    open introcreate bug

    hi, i have implemented a PIN code system, so when i create a character i need to insert a pin code for it. Now there is 2 inputline, name and pin code. But i cant click into the PIN code line, i only can get to that with TAB. vica versa. even in debug mode, there is no "PointWindow" event if i hover the mouse over. Thank you.
  19. bumxd

    open core crush

    https://pastebin.com/KuqBNHUv
  20. Dobrescu Sebastian

    open core crush

    Your mount quest.
  21. bumxd

    open core crush

    i dont understand what the quest with point you mean
  22. Dobrescu Sebastian

    open core crush

    Post your quest.
  23. good luck with searching! best regards
  24. bumxd

    open core crush

    can give example bug quest with null point?
  25. Dobrescu Sebastian

    open core crush

    Yes i had the same errors. I had to make sure my quest doesn't send any null pointers.
  1. Load more activity
×